{"text_format":"1","workbook":"xlsx","n_sheets":7,"sheets":["FORM","CALCULATIONS","POSTCODE POLICY ENGINE","HEM","POSTCODES","SETUP","HOW TO USE"],"not_rendered":{"charts":0,"images":1,"macros":1,"external_links":4,"defined_names":54,"comments":0,"pivot_tables":0},"unopened":[],"bounds":{"document_bytes":16777216,"sheet_cells":100000,"rows_first":2000,"rows_last":500,"rows_between":2000,"halvings":0,"cell_chars":16384,"cell_head_chars":4096},"cells_cut":0,"cells_raw":0,"read":"whole","date_system":"1900"}

{"sheet":"FORM","index":0,"n_rows":101,"n_cols":120,"rows_kept":101,"cut":false,"hidden":false,"merged":[[6,51,6,56],[6,57,6,58],[6,117,6,118],[100,1,100,12],[100,13,100,20],[0,39,0,44],[0,45,0,46],[23,119,24,122],[25,119,25,122],[26,119,26,122],[27,119,27,122],[28,119,28,122],[29,119,29,122],[30,119,30,122],[3,51,3,56],[3,57,3,58],[4,51,4,56],[5,51,5,56],[4,57,4,58],[5,57,5,58],[21,1,21,58],[3,45,3,46],[4,45,4,46],[8,45,8,58],[12,31,13,35],[12,36,13,58],[14,1,14,6],[23,23,24,30],[23,1,24,22],[25,1,25,22],[25,23,25,30],[25,31,25,34],[25,35,25,38],[23,31,24,34],[23,35,24,38],[14,7,14,16],[14,17,14,21],[14,22,14,25],[14,26,14,30],[14,31,14,35],[14,36,14,58],[15,1,15,6],[15,7,15,16],[15,17,15,21],[15,22,15,25],[15,26,15,30],[15,31,15,35],[15,36,15,58],[23,55,24,58],[23,39,24,42],[23,43,24,46],[23,47,24,50],[23,51,24,54],[25,39,25,42],[25,43,25,46],[25,47,25,50],[25,51,25,54],[25,55,25,58],[35,29,36,34],[35,35,36,38],[93,33,93,44],[93,45,93,48],[55,1,55,32],[55,33,55,36],[55,37,55,58],[55,61,55,92],[59,33,59,36],[59,37,59,58],[59,61,59,92],[57,33,57,36],[57,37,57,58],[57,61,57,92],[79,25,79,28],[80,25,80,28],[81,25,81,28],[76,33,76,36],[77,33,77,36],[78,33,78,36],[87,1,87,58],[70,1,70,12],[71,1,71,12],[72,1,72,12],[40,1,40,16],[37,43,37,46],[37,47,37,50],[37,51,37,54],[42,1,42,16],[43,1,43,16],[43,17,43,24],[38,51,38,54],[39,51,39,54],[38,25,38,28],[38,29,38,34],[38,35,38,38],[37,25,37,28],[43,39,43,42],[43,51,43,54],[58,61,58,92],[58,93,58,96],[58,97,58,118],[55,93,55,96],[55,97,55,118],[57,93,57,96],[57,97,57,118],[56,61,56,92],[56,93,56,96],[56,97,56,118],[54,61,54,92],[54,93,54,96],[54,97,54,118],[98,1,98,4],[97,1,97,4],[91,13,91,20],[92,13,92,20],[93,13,93,20],[92,1,92,12],[93,1,93,12],[91,1,91,12],[94,1,94,12],[94,13,94,20],[96,1,96,4],[70,17,70,20],[68,33,69,36],[73,33,73,36],[74,33,74,36],[75,33,75,36],[70,33,70,36],[82,25,82,28],[59,93,59,96],[59,97,59,118],[58,33,58,36],[30,55,30,58],[28,51,28,54],[28,55,28,58],[30,43,30,46],[30,47,30,50],[26,43,26,46],[26,47,26,50],[30,39,30,42],[29,1,29,22],[29,23,29,30],[29,31,29,34],[29,35,29,38],[29,39,29,42],[28,1,28,22],[28,23,28,30],[28,31,28,34],[28,35,28,38],[28,39,28,42],[26,1,26,22],[26,23,26,30],[26,31,26,34],[26,51,26,54],[26,55,26,58],[26,35,26,38],[31,55,31,58],[41,39,41,42],[41,43,41,46],[41,47,41,50],[35,55,36,58],[35,39,36,42],[41,55,41,58],[35,43,36,46],[35,47,36,50],[35,51,36,54],[40,43,40,46],[40,47,40,50],[40,51,40,54],[38,43,38,46],[38,47,38,50],[37,39,37,42],[38,39,38,42],[39,47,39,50],[37,55,37,58],[29,55,29,58],[30,1,30,22],[30,23,30,30],[30,31,30,34],[30,35,30,38],[10,1,10,58],[12,1,13,6],[12,7,13,16],[12,17,13,21],[12,22,13,25],[12,26,13,30],[16,1,16,6],[27,43,27,46],[27,47,27,50],[27,51,27,54],[27,55,27,58],[28,43,28,46],[28,47,28,50],[29,43,29,46],[29,47,29,50],[29,51,29,54],[27,1,27,22],[27,23,27,30],[27,31,27,34],[31,35,31,38],[31,1,31,34],[2,39,2,44],[3,39,3,44],[4,39,4,44],[8,39,8,44],[31,43,31,54],[27,35,27,38],[27,39,27,42],[26,39,26,42],[30,51,30,54],[16,7,16,16],[16,17,16,21],[16,22,16,25],[16,26,16,30],[16,31,16,35],[16,36,16,58],[17,1,17,6],[17,7,17,16],[17,17,17,21],[17,22,17,25],[17,26,17,30],[17,31,17,35],[17,36,17,58],[96,45,96,48],[90,33,90,44],[91,33,91,44],[92,33,92,44],[94,33,94,44],[95,33,95,44],[96,33,96,44],[78,29,78,32],[35,1,36,16],[41,1,41,16],[39,17,39,24],[39,25,39,28],[39,29,39,34],[39,35,39,38],[38,17,38,24],[35,17,36,24],[35,25,36,28],[37,1,37,16],[38,1,38,16],[39,1,39,16],[54,1,54,32],[54,33,54,36],[54,37,54,58],[58,37,58,58],[72,33,72,36],[95,45,95,48],[94,45,94,48],[92,45,92,48],[91,45,91,48],[90,45,90,48],[78,1,78,16],[83,33,83,36],[84,33,84,36],[79,29,79,32],[80,29,80,32],[81,29,81,32],[82,29,82,32],[79,1,79,12],[80,1,80,12],[81,1,81,12],[82,1,82,12],[79,21,79,24],[80,21,80,24],[81,21,81,24],[82,21,82,24],[82,17,82,20],[78,21,78,24],[72,21,72,24],[81,17,81,20],[90,1,90,12],[90,13,90,20],[82,33,82,36],[78,17,78,20],[79,17,79,20],[80,17,80,20],[76,1,76,12],[77,1,77,12],[76,17,76,20],[77,17,77,20],[76,21,76,24],[77,25,77,28],[76,29,76,32],[77,29,77,32],[77,21,77,24],[76,25,76,28],[79,33,79,36],[80,33,80,36],[81,33,81,36],[78,25,78,28],[73,1,73,12],[74,1,74,12],[72,25,72,28],[73,25,73,28],[74,25,74,28],[75,25,75,28],[75,1,75,12],[72,17,72,20],[73,17,73,20],[74,17,74,20],[75,17,75,20],[73,21,73,24],[74,21,74,24],[75,21,75,24],[68,17,69,20],[68,21,69,24],[68,25,69,28],[68,29,69,32],[71,29,71,32],[72,29,72,32],[73,29,73,32],[74,29,74,32],[75,29,75,32],[71,17,71,20],[71,25,71,28],[70,21,70,24],[71,21,71,24],[70,29,70,32],[70,25,70,28],[62,61,62,92],[62,93,62,96],[62,97,62,118],[60,61,60,92],[60,93,60,96],[60,97,60,118],[61,61,61,92],[61,93,61,96],[61,97,61,118],[63,93,63,96],[63,97,63,118],[64,61,64,92],[64,93,64,96],[64,97,64,118],[63,61,63,92],[71,33,71,36],[23,107,24,110],[23,111,24,114],[49,61,49,118],[51,93,52,96],[51,97,52,118],[53,61,53,92],[53,93,53,96],[53,97,53,118],[25,61,25,82],[25,83,25,90],[25,91,25,94],[25,95,25,98],[25,103,25,106],[26,61,26,82],[26,83,26,90],[26,91,26,94],[26,95,26,98],[2,99,2,104],[3,99,3,104],[3,105,3,106],[4,99,4,104],[4,105,4,106],[8,99,8,104],[8,105,8,118],[21,61,21,118],[23,115,24,118],[23,61,24,82],[3,117,3,118],[4,117,4,118],[5,117,5,118],[26,99,26,102],[23,83,24,90],[23,91,24,94],[23,95,24,98],[23,99,24,102],[27,61,27,82],[27,83,27,90],[27,91,27,94],[27,95,27,98],[27,99,27,102],[27,103,27,106],[27,107,27,110],[27,111,27,114],[27,115,27,118],[29,61,29,82],[29,83,29,90],[29,91,29,94],[29,95,29,98],[29,99,29,102],[28,61,28,82],[28,83,28,90],[28,91,28,94],[28,95,28,98],[28,99,28,102],[42,61,42,76],[41,61,41,76],[40,61,40,76],[30,115,30,118],[33,61,33,118],[35,77,36,84],[35,85,36,88],[35,89,36,94],[35,95,36,98],[30,103,30,106],[30,107,30,110],[30,61,30,82],[30,83,30,90],[30,91,30,94],[30,95,30,98],[30,99,30,102],[35,61,36,76],[37,61,37,76],[38,61,38,76],[39,61,39,76],[35,99,36,102],[35,103,36,106],[35,107,36,110],[35,111,36,114],[35,115,36,118],[30,111,30,114],[29,107,29,110],[29,111,29,114],[29,115,29,118],[29,103,29,106],[28,103,28,106],[28,107,28,110],[28,111,28,114],[28,115,28,118],[26,103,26,106],[26,107,26,110],[26,111,26,114],[26,115,26,118],[25,107,25,110],[25,111,25,114],[23,103,24,106],[43,61,43,76],[44,1,44,16],[44,17,44,24],[44,25,44,28],[44,29,44,34],[44,35,44,38],[44,39,44,42],[44,43,44,46],[44,47,44,50],[44,51,44,54],[44,55,44,58],[44,61,44,76],[43,43,43,46],[43,47,43,50],[43,25,43,28],[43,29,43,34],[43,35,43,38],[97,45,97,48],[97,33,97,44],[45,55,45,58],[45,61,45,76],[46,1,46,16],[46,17,46,24],[46,25,46,28],[46,29,46,34],[46,35,46,38],[46,39,46,42],[46,43,46,46],[46,47,46,50],[46,51,46,54],[46,55,46,58],[46,61,46,76],[45,1,45,16],[45,17,45,24],[45,25,45,28],[45,29,45,34],[45,35,45,38],[45,39,45,42],[45,43,45,46],[45,47,45,50],[45,51,45,54],[18,1,18,6],[18,7,18,16],[18,17,18,21],[18,22,18,25],[18,26,18,30],[18,31,18,35],[18,36,18,58],[53,1,53,32],[40,17,40,24],[40,25,40,28],[40,29,40,34],[40,35,40,38],[40,39,40,42],[39,39,39,42],[39,43,39,46],[33,1,33,58],[40,55,40,58],[38,55,38,58],[39,55,39,58],[37,17,37,24],[37,29,37,34],[37,35,37,38],[19,1,19,6],[19,7,19,16],[19,17,19,21],[19,22,19,25],[19,26,19,30],[19,31,19,35],[19,36,19,58],[43,55,43,58],[66,1,66,58],[47,1,47,54],[64,37,64,58],[63,37,63,58],[53,37,53,58],[60,37,60,58],[61,37,61,58],[62,37,62,58],[64,33,64,36],[53,33,53,36],[60,33,60,36],[61,33,61,36],[62,33,62,36],[63,33,63,36],[62,1,62,32],[61,1,61,32],[42,17,42,24],[42,25,42,28],[47,55,47,58],[49,1,49,58],[51,33,52,36],[51,37,52,58],[64,1,64,32],[63,1,63,32],[42,55,42,58],[41,51,41,54],[42,43,42,46],[42,47,42,50],[42,51,42,54],[42,29,42,34],[42,35,42,38],[42,39,42,42],[41,25,41,28],[41,29,41,34],[41,35,41,38],[41,17,41,24],[56,1,56,32],[56,33,56,36],[56,37,56,58]]}
[null,null,null,null,null,null,null,null,null,null,null,null,null,null,null,null,null,null,null,null,null,null,null,null,null,null,null,null,null,null,null,null,null,null,null,null,null,null,null,"Calculator Version:",null,null,null,null,null,"v55"]
[]
[null,null,null,null,null,null,null,null,null,null,null,null,null,null,null,null,null,null,null,null,null,null,null,null,null,null,null,null,null,null,null,null,null,null,null,null,null,null,null,"Number of applicants:",null,null,null,null,null,null,null,null,null,null,null,"Number of dependants",null,null,null,null,null,null,null,null,null,null,null,null,null,null,null,null,null,null,null,null,null,null,null,null,null,null,null,null,null,null,null,null,null,null,null,null,null,null,null,null,null,null,null,null,null,null,null,"Number of applicants:",null,null,null,null,null,null,null,null,null,null,null,"Number of dependants"]
[null,null,null,null,null,null,null,null,null,null,null,null,null,null,null,null,null,null,null,null,null,null,null,null,null,null,null,null,null,null,null,null,null,null,null,null,null,null,null,"Couples",null,null,null,null,null,null,null,null,null,null,null,{"$f":"CALCULATIONS!K56","v":""},null,null,null,null,null,0,null,null,null,null,null,null,null,null,null,null,null,null,null,null,null,null,null,null,null,null,null,null,null,null,null,null,null,null,null,null,null,null,null,null,null,null,null,null,null,null,null,"Couples",null,null,null,null,null,{"$f":"IF(FORM!AT4=\"\",1,0)","v":1},null,null,null,null,null,{"$f":"FORM!AZ4","v":""},null,null,null,null,null,{"$f":"IF(AND(FORM!BF4=\"\",DH4<>\"\"),1,0)","v":0}]
[null,null,null,null,null,null,null,null,null,null,null,null,null,null,null,null,null,null,null,null,null,null,null,null,null,null,null,null,null,null,null,null,null,null,null,null,null,null,null,"Single adults",null,null,null,null,null,null,null,null,null,null,null,{"$f":"CALCULATIONS!K57","v":""},null,null,null,null,null,0,null,null,null,null,null,null,null,null,null,null,null,null,null,null,null,null,null,null,null,null,null,null,null,null,null,null,null,null,null,null,null,null,null,null,null,null,null,null,null,null,null,"Single adults",null,null,null,null,null,{"$f":"IF(FORM!AT5=\"\",1,0)","v":1},null,null,null,null,null,{"$f":"FORM!AZ5","v":""},null,null,null,null,null,{"$f":"IF(AND(FORM!BF5=\"\",DH5<>\"\"),1,0)","v":0}]
[null,null,null,null,null,null,null,null,null,null,null,null,null,null,null,null,null,null,null,null,null,null,null,null,null,null,null,null,null,null,null,null,null,null,null,null,null,null,null,null,null,null,null,null,null,null,null,null,null,null,null,{"$f":"CALCULATIONS!K58","v":""},null,null,null,null,null,null,null,null,null,null,null,null,null,null,null,null,null,null,null,null,null,null,null,null,null,null,null,null,null,null,null,null,null,null,null,null,null,null,null,null,null,null,null,null,null,null,null,null,null,null,null,null,null,null,null,null,null,null,null,{"$f":"FORM!AZ6","v":""},null,null,null,null,null,{"$f":"IF(AND(FORM!BF6=\"\",DH6<>\"\"),1,0)","v":0}]
{"$rows_left_out":96}
{"sheet":"CALCULATIONS","index":1,"n_rows":180,"n_cols":21,"rows_kept":180,"cut":false,"hidden":true,"merged":[[121,2,121,3],[121,11,121,12]]}
[]
[null,null,"Proposed product calculations"]
[]
[null,null,"Postcode","Property Type","Land Size","State","Category","AFG Cat","Metro Type","Accepted Rates","AFG Policy Engine"]
[null,1,{"$f":"FORM!B15","v":0},{"$f":"FORM!H15","v":0},{"$f":"FORM!R15","v":0},{"$f":"IF(AND(D5=0,E5=0),\"\",_xlfn.IFNA(VLOOKUP(C5,POSTCODES!$A:$E,2,0),\"\"))","v":""},{"$f":"IF(AND(D5=0,E5=0),\"\",_xlfn.IFNA(\"Cat \"&VLOOKUP(C5,POSTCODES!A:E,4,0),\"\"))","v":""},{"$f":"IF(AND(D5=0,E5=0),\"\",_xlfn.IFNA(VLOOKUP(C5,POSTCODES!A:E,3,0),\"\"))","v":""},{"$f":"IF(AND(D5=0,E5=0),\"\",_xlfn.IFNA(VLOOKUP(C5,POSTCODES!A:E,5,0),\"\"))","v":""},{"$f":"IF(OR(C5=0,C5=\"\"),\"\",IF(AND(D5=0,E5=0),\"Insufficient Information\",K5))","v":""},{"$f":"IF(COUNTIFS($C$15:$C$20,\"Retro Lite\")=0,\nIF(COUNTIFS($C$15:$C$20,\"Retro Switch\")=0,\nIF(COUNTIFS($C$15:$C$20,\"Retro Thrive\")=0,\n_xlfn.XLOOKUP(\"Retro\"&\":\"&D5&\":\"&E5&\":\"&H5&\":\"&I5,'POSTCODE POLICY ENGINE'!A:A,'POSTCODE POLICY ENGINE'!G:G),\n_xlfn.XLOOKUP(\"Retro Thrive\"&\":\"&D5&\":\"&E5&\":\"&H5&\":\"&I5,'POSTCODE POLICY ENGINE'!A:A,'POSTCODE POLICY ENGINE'!G:G)),\n_xlfn.XLOOKUP(\"Retro SWITCH\"&\":\"&D5&\":\"&E5&\":\"&H5&\":\"&I5,'POSTCODE POLICY ENGINE'!A:A,'POSTCODE POLICY ENGINE'!G:G)),\n_xlfn.XLOOKUP(\"Retro Lite\"&\":\"&D5&\":\"&E5&\":\"&H5&\":\"&I5,'POSTCODE POLICY ENGINE'!A:A,'POSTCODE POLICY ENGINE'!G:G))","v":{"$error":"#N/A"}},null,{"$f":"\"Retro\"&\":\"&D5&\":\"&E5&\":\"&H5&\":\"&I5","v":"Retro:0:0::"}]
[null,{"$f":"B5+1","v":2},{"$f":"FORM!B16","v":0},{"$f":"FORM!H16","v":0},{"$f":"FORM!R16","v":0},{"$f":"IF(AND(D6=0,E6=0),\"\",_xlfn.IFNA(VLOOKUP(C6,POSTCODES!$A:$E,2,0),\"\"))","v":""},{"$f":"IF(AND(D6=0,E6=0),\"\",_xlfn.IFNA(\"Cat \"&VLOOKUP(C6,POSTCODES!A:E,4,0),\"\"))","v":""},{"$f":"IF(AND(D6=0,E6=0),\"\",_xlfn.IFNA(VLOOKUP(C6,POSTCODES!A:E,3,0),\"\"))","v":""},{"$f":"IF(AND(D6=0,E6=0),\"\",_xlfn.IFNA(VLOOKUP(C6,POSTCODES!A:E,5,0),\"\"))","v":""},{"$f":"IF(OR(C6=0,C6=\"\"),\"\",IF(AND(D6=0,E6=0),\"Insufficient Information\",K6))","v":""},{"$f":"IF(COUNTIFS($C$15:$C$20,\"Retro Lite\")=0,IF(COUNTIFS($C$15:$C$20,\"Retro Switch\")=0,_xlfn.XLOOKUP(\"Retro\"&\":\"&D6&\":\"&E6&\":\"&H6&\":\"&I6,'POSTCODE POLICY ENGINE'!A:A,'POSTCODE POLICY ENGINE'!G:G),_xlfn.XLOOKUP(\"Retro SWITCH\"&\":\"&D6&\":\"&E6&\":\"&H6&\":\"&I6,'POSTCODE POLICY ENGINE'!A:A,'POSTCODE POLICY ENGINE'!G:G)),_xlfn.XLOOKUP(\"Retro Lite\"&\":\"&D6&\":\"&E6&\":\"&H6&\":\"&I6,'POSTCODE POLICY ENGINE'!A:A,'POSTCODE POLICY ENGINE'!G:G))","v":{"$error":"#N/A"}}]
{"$rows_left_out":175}
{"sheet":"POSTCODE POLICY ENGINE","index":2,"n_rows":293,"n_cols":9,"rows_kept":293,"cut":false,"hidden":true,"merged":[]}
["ID","Product","Property Type","Landsize","Category","Metro Type","Proposed Policy Engine"]
[{"$f":"B2&\":\"&C2&\":\"&D2&\":\"&E2&\":\"&F2","v":"Retro:Vacant Land/Construction:<= 2500sqm:1:Inner City"},"Retro","Vacant Land/Construction","<= 2500sqm",1,"Inner City","Construction Loan Interest Rates"]
["Retro:Vacant Land/Construction:<= 2500sqm:1:Metro","Retro","Vacant Land/Construction","<= 2500sqm",1,"Metro","Construction Loan Interest Rates"]
["Retro:Vacant Land/Construction:<= 2500sqm:1:Non Metro","Retro","Vacant Land/Construction","<= 2500sqm",1,"Non Metro","Construction Loan Interest Rates"]
["Retro Lite:Vacant Land/Construction:<= 2500sqm:1:Inner City","Retro Lite","Vacant Land/Construction","<= 2500sqm",1,"Inner City","Please contact your AFG – Home Loans BRM"]
["Retro Lite:Vacant Land/Construction:<= 2500sqm:1:Metro","Retro Lite","Vacant Land/Construction","<= 2500sqm",1,"Metro","Please contact your AFG – Home Loans BRM"]
{"$rows_left_out":288}
{"sheet":"HEM","index":3,"n_rows":37,"n_cols":16,"rows_kept":37,"cut":false,"hidden":true,"merged":[[35,1,35,8],[36,1,36,8],[4,15,4,24],[5,15,5,24],[6,15,6,24]]}
[null,"House Hold Income Brackets",null,null,null,null,null,null,null,null,"Insert a new column to the left if need additional"]
["From",0,74000,99000,124000,149000,173000,198000,248000,309000,371000]
[]
["To",74000,99000,124000,149000,173000,198000,248000,309000,371000,1000000,null,null,null,null,"Living Expense Assumptions"]
["Couple ",33085.585963158206,35982.635636732091,40127.678981138604,43978.774539267812,48559.415369494127,50843.810720480724,53361.93701666595,59922.816380941178,66217.722568050725,68381.889013556778,null,null,null,null,"Floor Limit implemented HH Inc $54k - $65k"]
["Couple 1",37621.885646388109,40516.195435140566,44657.320666035004,48504.775965597808,53081.08693260204,55363.321992176512,57879.068983105193,64433.746658290002,70722.702568179346,72884.82332945778,null,null,null,null,"Couple and Single Australian Av used"]
{"$rows_left_out":32}
{"sheet":"POSTCODES","index":4,"n_rows":2672,"n_cols":5,"rows_kept":2672,"cut":false,"hidden":true,"merged":[]}
["postcode","State","AFG Category","Other","Non metro"]
["0800","NT",1,1,"Metro"]
["0801","NT",1,1,"Metro"]
["0810","NT",1,1,"Metro"]
["0812","NT",1,1,"Metro"]
["0815","NT",1,1,"Metro"]
{"$rows_left_out":2667}
{"sheet":"SETUP","index":5,"n_rows":67,"n_cols":22,"rows_kept":67,"cut":false,"hidden":true,"merged":[]}
[null,null,null,null,null,null,null,null,null,null,null,null,{"$f":"INDEX(FORM!$B$38:$W$48,M3,1)","v":0},{"$f":"INDEX(FORM!$B$38:$W$48,N3,1)","v":0},{"$f":"INDEX(FORM!$B$38:$W$48,O3,1)","v":0},{"$f":"INDEX(FORM!$B$38:$W$48,P3,1)","v":0},{"$f":"INDEX(FORM!$B$38:$W$48,Q3,1)","v":0},{"$f":"INDEX(FORM!$B$38:$W$48,R3,1)","v":0},{"$f":"INDEX(FORM!$B$38:$W$48,S3,1)","v":0},{"$f":"INDEX(FORM!$B$38:$W$48,T3,1)","v":0},{"$f":"INDEX(FORM!$B$38:$W$48,U3,1)","v":0},{"$f":"INDEX(FORM!$B$38:$W$48,V3,1)","v":0}]
[null,null,null,null,null,null,"ExProd","YN","NewProd","LoanType","PropertyType","PropertySize","LTP_1","LTP_2","LTP_3","LTP_4","LTP_5","LTP_6","LTP_7","LTP_8","LTP_9","LTP_10"]
[null,"Description","Value","Name",null,null,"Existing loan products","Y/N","Proposed loan product","Home loan type","Security Type","Land Size",1,{"$f":"M3+1","v":2},{"$f":"N3+1","v":3},4,5,6,7,8,9,10]
[null,null,null,null,null,null,"Home Loan","Yes","Retro","Owner occupied","Apartment/Unit/Villa","<= 2500sqm",{"$f":"IF(OR(M$1=\"Home Loan\",M$1=$G$10,M$1=\"Line of Credit\"),SETUP!$J4,\"\")","v":""},{"$f":"IF(OR(N$1=\"Home Loan\",N$1=$G$10,N$1=\"Line of Credit\"),SETUP!$J4,\"\")","v":""},{"$f":"IF(OR(O$1=\"Home Loan\",O$1=$G$10,O$1=\"Line of Credit\"),SETUP!$J4,\"\")","v":""},{"$f":"IF(OR(P$1=\"Home Loan\",P$1=$G$10,P$1=\"Line of Credit\"),SETUP!$J4,\"\")","v":""},{"$f":"IF(OR(Q$1=\"Home Loan\",Q$1=$G$10,Q$1=\"Line of Credit\"),SETUP!$J4,\"\")","v":""},{"$f":"IF(OR(R$1=\"Home Loan\",R$1=$G$10,R$1=\"Line of Credit\"),SETUP!$J4,\"\")","v":""},{"$f":"IF(OR(S$1=\"Home Loan\",S$1=$G$10,S$1=\"Line of Credit\"),SETUP!$J4,\"\")","v":""},{"$f":"IF(OR(T$1=\"Home Loan\",T$1=$G$10,T$1=\"Line of Credit\"),SETUP!$J4,\"\")","v":""},{"$f":"IF(OR(U$1=\"Home Loan\",U$1=$G$10,U$1=\"Line of Credit\"),SETUP!$J4,\"\")","v":""},{"$f":"IF(OR(V$1=\"Home Loan\",V$1=$G$10,V$1=\"Line of Credit\"),SETUP!$J4,\"\")","v":""}]
[null,"Home loans assessment rate",null,null,null,null,"Line of Credit","No","Retro Lite","Investor","Vacant Land/Construction",">2500sqm",{"$f":"IF(OR(M$1=\"Home Loan\",M$1=$G$10,M$1=\"Line of Credit\"),SETUP!$J5,\"\")","v":""},{"$f":"IF(OR(N$1=\"Home Loan\",N$1=$G$10,N$1=\"Line of Credit\"),SETUP!$J5,\"\")","v":""},{"$f":"IF(OR(O$1=\"Home Loan\",O$1=$G$10,O$1=\"Line of Credit\"),SETUP!$J5,\"\")","v":""},{"$f":"IF(OR(P$1=\"Home Loan\",P$1=$G$10,P$1=\"Line of Credit\"),SETUP!$J5,\"\")","v":""},{"$f":"IF(OR(Q$1=\"Home Loan\",Q$1=$G$10,Q$1=\"Line of Credit\"),SETUP!$J5,\"\")","v":""},{"$f":"IF(OR(R$1=\"Home Loan\",R$1=$G$10,R$1=\"Line of Credit\"),SETUP!$J5,\"\")","v":""},{"$f":"IF(OR(S$1=\"Home Loan\",S$1=$G$10,S$1=\"Line of Credit\"),SETUP!$J5,\"\")","v":""},{"$f":"IF(OR(T$1=\"Home Loan\",T$1=$G$10,T$1=\"Line of Credit\"),SETUP!$J5,\"\")","v":""},{"$f":"IF(OR(U$1=\"Home Loan\",U$1=$G$10,U$1=\"Line of Credit\"),SETUP!$J5,\"\")","v":""},{"$f":"IF(OR(V$1=\"Home Loan\",V$1=$G$10,V$1=\"Line of Credit\"),SETUP!$J5,\"\")","v":""}]
[null,"Greater of",5.0500000000000003E-2,"AssessFloor",null,null,"Personal Loan",null,"Retro Switch",null,"Established Property"]
{"$rows_left_out":62}
{"sheet":"HOW TO USE","index":6,"n_rows":62,"n_cols":118,"rows_kept":62,"cut":false,"hidden":false,"merged":[[3,105,3,106],[3,117,3,118],[4,99,4,104],[4,105,4,106],[4,117,4,118],[2,99,2,104],[3,99,3,104],[14,115,15,118],[14,61,15,82],[14,83,15,90],[14,91,15,94],[10,99,10,104],[10,105,10,118],[12,61,12,118],[5,117,5,118],[6,117,6,118],[16,95,16,98],[16,103,16,106],[16,107,16,110],[16,111,16,114],[16,61,16,82],[16,83,16,90],[16,91,16,94],[14,95,15,98],[14,99,15,102],[14,103,15,106],[14,107,15,110],[14,111,15,114],[17,95,17,98],[17,99,17,102],[17,103,17,106],[17,107,17,110],[17,111,17,114],[17,115,17,118],[17,61,17,82],[17,83,17,90],[17,91,17,94],[19,111,19,114],[19,115,19,118],[19,61,19,82],[19,83,19,90],[19,91,19,94],[26,115,26,118],[18,95,18,98],[18,99,18,102],[18,103,18,106],[18,107,18,110],[18,111,18,114],[18,115,18,118],[18,61,18,82],[18,83,18,90],[18,91,18,94],[26,61,26,82],[26,83,26,90],[26,91,26,94],[26,95,26,98],[26,99,26,102],[19,95,19,98],[19,99,19,102],[19,103,19,106],[19,107,19,110],[35,61,35,76],[25,61,25,82],[25,83,25,90],[25,91,25,94],[25,95,25,98],[25,99,25,102],[25,103,25,106],[25,107,25,110],[25,111,25,114],[26,103,26,106],[26,107,26,110],[26,111,26,114],[31,61,31,118],[33,61,34,76],[33,77,34,84],[33,85,34,88],[33,89,34,94],[33,95,34,98],[33,99,34,102],[33,103,34,106],[33,107,34,110],[33,111,34,114],[33,115,34,118],[25,115,25,118],[39,61,39,76],[38,61,38,76],[37,61,37,76],[40,61,40,76],[41,61,41,76],[42,61,42,76],[43,61,43,76],[44,61,44,76],[36,61,36,76],[53,61,53,92],[53,93,53,96],[53,97,53,118],[49,61,49,118],[51,93,52,96],[51,97,52,118],[56,61,56,92],[56,93,56,96],[56,97,56,118],[55,61,55,92],[55,93,55,96],[55,97,55,118],[54,61,54,92],[54,93,54,96],[54,97,54,118],[60,61,60,92],[60,93,60,96],[60,97,60,118],[61,61,61,92],[61,93,61,96],[61,97,61,118],[57,61,57,92],[57,93,57,96],[57,97,57,118],[58,61,58,92],[58,93,58,96],[58,97,58,118],[59,61,59,92],[59,93,59,96],[59,97,59,118]]}
[]
[null,"Servicing calculator - Notes and guidelines"]
[null,null,null,null,null,null,null,null,null,null,null,null,null,null,null,null,null,null,null,null,null,null,null,null,null,null,null,null,null,null,null,null,null,null,null,null,null,null,null,null,null,null,null,null,null,null,null,null,null,null,null,null,null,null,null,null,null,null,null,null,null,null,null,null,null,null,null,null,null,null,null,null,null,null,null,null,null,null,null,null,null,null,null,null,null,null,null,null,null,null,null,null,null,null,null,null,null,null,null,"Number of applicants:",null,null,null,null,null,null,null,null,null,null,null,"Number of dependants"]
[null,"The servicing calculator is designed to assist capture the required data to assess loan affordability based on declared living expenses and commitments (the calculator uses HEM living expense methodolgy ",null,null,null,null,null,null,null,null,null,null,null,null,null,null,null,null,null,null,null,null,null,null,null,null,null,null,null,null,null,null,null,null,null,null,null,null,null,null,null,null,null,null,null,null,null,null,null,null,null,null,null,null,null,null,null,null,null,null,null,null,null,null,null,null,null,null,null,null,null,null,null,null,null,null,null,null,null,null,null,null,null,null,null,null,null,null,null,null,null,null,null,null,null,null,null,null,null,"Couples",null,null,null,null,null,1,null,null,null,null,null,0,null,null,null,null,null,1]
[null,"as a floor limit only and should not be relied upon to assess the customers true living expense).  When assessing the data it is important to determine whether the declared living and commitment expenses ",null,null,null,null,null,null,null,null,null,null,null,null,null,null,null,null,null,null,null,null,null,null,null,null,null,null,null,null,null,null,null,null,null,null,null,null,null,null,null,null,null,null,null,null,null,null,null,null,null,null,null,null,null,null,null,null,null,null,null,null,null,null,null,null,null,null,null,null,null,null,null,null,null,null,null,null,null,null,null,null,null,null,null,null,null,null,null,null,null,null,null,null,null,null,null,null,null,"Single adults",null,null,null,null,null,1,null,null,null,null,null,0,null,null,null,null,null,1]
[null,"are reasonable for the customers circumstances (customers trasactional banking statements are one way of reviewing customer commitments).",null,null,null,null,null,null,null,null,null,null,null,null,null,null,null,null,null,null,null,null,null,null,null,null,null,null,null,null,null,null,null,null,null,null,null,null,null,null,null,null,null,null,null,null,null,null,null,null,null,null,null,null,null,null,null,null,null,null,null,null,null,null,null,null,null,null,null,null,null,null,null,null,null,null,null,null,null,null,null,null,null,null,null,null,null,null,null,null,null,null,null,null,null,null,null,null,null,null,null,null,null,null,null,null,null,null,null,null,null,0,null,null,null,null,null,1]
{"$rows_left_out":56}